Target
Nicotinamide phosphoribosyltransferase
Ligand
BDBM50443804
Substrate
Meas. Tech.
ChEMBL_1280599 (CHEMBL3096860)
IC50
39±n/a nM
Citation
 Christensen, MKErichsen, KDOlesen, UHTjørnelund, JFristrup, PThougaard, ANielsen, SJSehested, MJensen, PBLoza, EKalvinsh, IGarten, AKiess, WBjörkling, F Nicotinamide phosphoribosyltransferase inhibitors, design, preparation, and structure-activity relationship. J Med Chem 56:9071-88 (2013)  
Target
Name:
Nicotinamide phosphoribosyltransferase
Synonyms:
NAMPT NAmPRTase Nicotinamide phosphoribosyltransferase (NAMPT) PBEF1 | Pre-B-cell colony-enhancing factor 1
Type:
Enzyme
Mol. Mass.:
55524.98
Organism:
Homo sapiens (Human)
Description:
P43490
Residue:
491
  
Inhibitor
Name:
BDBM50443804
Synonyms:
CHEMBL2417795
Type:
Small organic molecule
Emp. Form.:
C27H36N6O2
Mol. Mass.:
476.6137
SMILES:
O=C(CCCCCCNC(NC#N)=Nc1ccncc1)N(Cc1ccccc1)OC1CCCCC1
: