Target
Peptidyl-prolyl cis-trans isomerase NIMA-interacting 1
Ligand
BDBM50444913
Substrate
Meas. Tech.
ChEMBL_1281313 (CHEMBL3101286)
Ki
16000±n/a nM
Citation
 Belal, AEl-Gendy, Bel-D Pyrrolizines: Promising scaffolds for anticancer drugs. Bioorg Med Chem 22:46-53 (2013)  
Target
Name:
Peptidyl-prolyl cis-trans isomerase NIMA-interacting 1
Synonyms:
PIN1 PPIase Pin1 | Peptidyl-prolyl cis-trans isomerase NIMA-interacting 1
Type:
PROTEIN
Mol. Mass.:
18248.11
Organism:
Homo sapiens (Human)
Description:
ChEMBL_1502595
Residue:
163
  
Inhibitor
Name:
BDBM50444913
Synonyms:
CHEMBL3099731
Type:
Small organic molecule
Emp. Form.:
C22H22F5N2O5P
Mol. Mass.:
520.3863
SMILES:
OP(O)(=O)OCC1C2CCCN2C(C1C(=O)NCc1ccccc1)c1c(F)c(F)c(F)c(F)c1F
: