Target
Cyclin-dependent kinase 2
Ligand
BDBM50444935
Substrate
Meas. Tech.
ChEMBL_1281340 (CHEMBL3101313)
Ki
<100±n/a nM
Citation
 Deng, YShipps, GWZhao, LSiddiqui, MAPopovici-Muller, JCurran, PJDuca, JSHruza, AWFischmann, TOMadison, VSZhang, RMcNemar, CWMayhood, TWSyto, RAnnis, AKirschmeier, PLees, EMParry, DAWindsor, WT Modulating the interaction between CDK2 and cyclin A with a quinoline-based inhibitor. Bioorg Med Chem Lett 24:199-203 (2013)  
Target
Name:
Cyclin-dependent kinase 2
Synonyms:
CDK2 CDK2_HUMAN Cell division protein kinase 2 Protein cereblon/Cyclin-dependent kinase 2 | p33 protein kinase
Type:
Enzyme Subunit
Mol. Mass.:
33938.17
Organism:
Homo sapiens (Human)
Description:
P24941
Residue:
298
  
Inhibitor
Name:
BDBM50444935
Synonyms:
CHEMBL3099761
Type:
Small organic molecule
Emp. Form.:
C28H21F3N2O6
Mol. Mass.:
538.4713
SMILES:
COC(=O)[C@H](Cc1ccc(O)cc1)NC(=O)c1cc(C(O)=O)c2cc(ccc2n1)-c1cccc(c1)C(F)(F)F
: