Target
Lysine-specific histone demethylase 1A
Ligand
BDBM50445346
Substrate
Meas. Tech.
ChEMBL_1285454 (CHEMBL3108243)
Ki
32±n/a nM
Citation
 Sorna, VTheisen, ERStephens, BWarner, SLBearss, DJVankayalapati, HSharma, S High-throughput virtual screening identifies novel N'-(1-phenylethylidene)-benzohydrazides as potent, specific, and reversible LSD1 inhibitors. J Med Chem 56:9496-508 (2014)  
Target
Name:
Lysine-specific histone demethylase 1A
Synonyms:
AOF2 Flavin-containing amine oxidase domain-containing protein 2 KDM1A KIAA0601 Lysine-specific demethylase 1 (LSD1) Lysine-specific histone demethylase 1 (LSD1)
Type:
Enzyme
Mol. Mass.:
92901.01
Organism:
Homo sapiens (Human)
Description:
O60341
Residue:
852
  
Inhibitor
Name:
BDBM50445346
Synonyms:
CHEMBL3104250
Type:
Small organic molecule
Emp. Form.:
C19H20ClN3O5S
Mol. Mass.:
437.897
SMILES:
CC(=NNC(=O)c1cccc(c1)S(=O)(=O)N1CCOCC1)c1cc(Cl)ccc1O
: