Target
Ezrin
Ligand
BDBM50445467
Substrate
Meas. Tech.
ChEMBL_1284145 (CHEMBL3107613)
Kd
27400±n/a nM
Citation
 Paige, MKosturko, GBulut, GMiessau, MRahim, SToretsky, JABrown, MLÜren, A Design, synthesis and biological evaluation of ezrin inhibitors targeting metastatic osteosarcoma. Bioorg Med Chem 22:478-87 (2013)  
Target
Name:
Ezrin
Synonyms:
Cytovillin EZRI_HUMAN Villin-2 | p81
Type:
Protein
Mol. Mass.:
69408.95
Organism:
Homo sapiens (Human)
Description:
P15311
Residue:
586
  
Inhibitor
Name:
BDBM50445467
Synonyms:
CHEMBL3104723
Type:
Small organic molecule
Emp. Form.:
C18H15BrN2O3
Mol. Mass.:
387.227
SMILES:
COc1ccc(CC=Nc2cc(O)c3cccnc3c2O)cc1Br
: