Target
Ezrin
Ligand
BDBM50106508
Substrate
Meas. Tech.
ChEMBL_1284145 (CHEMBL3107613)
Kd
10600±n/a nM
Citation
 Paige, MKosturko, GBulut, GMiessau, MRahim, SToretsky, JABrown, MLÜren, A Design, synthesis and biological evaluation of ezrin inhibitors targeting metastatic osteosarcoma. Bioorg Med Chem 22:478-87 (2013)  
Target
Name:
Ezrin
Synonyms:
Cytovillin EZRI_HUMAN Villin-2 | p81
Type:
Protein
Mol. Mass.:
69408.95
Organism:
Homo sapiens (Human)
Description:
P15311
Residue:
586
  
Inhibitor
Name:
BDBM50106508
Synonyms:
7-[2-(3,5-Dibromo-4-hydroxy-phenyl)-ethylamino]-quinoline-5,8-dione | CHEMBL336095
Type:
Small organic molecule
Emp. Form.:
C17H12Br2N2O3
Mol. Mass.:
452.097
SMILES:
Oc1cc(N=CCc2cc(Br)c(O)c(Br)c2)c(O)c2ncccc12
: