Target
15-hydroxyprostaglandin dehydrogenase [NAD(+)]
Ligand
BDBM50445562
Substrate
Meas. Tech.
ChEMBL_1285219 (CHEMBL3107150)
IC50
22±n/a nM
Citation
 Duveau, DYYasgar, AWang, YHu, XKouznetsova, JBrimacombe, KRJadhav, ASimeonov, AThomas, CJMaloney, DJ Structure-activity relationship studies and biological characterization of human NAD(+)-dependent 15-hydroxyprostaglandin dehydrogenase inhibitors. Bioorg Med Chem Lett 24:630-5 (2014)  
Target
Name:
15-hydroxyprostaglandin dehydrogenase [NAD(+)]
Synonyms:
15-PGDH HPGD PGDH_HUMAN SDR36C1
Type:
Enzyme
Mol. Mass.:
28974.46
Organism:
Homo sapiens (Human)
Description:
P15428
Residue:
266
  
Inhibitor
Name:
BDBM50445562
Synonyms:
CHEMBL3102994
Type:
Small organic molecule
Emp. Form.:
C19H20Cl2N4
Mol. Mass.:
375.295
SMILES:
Cc1cc(c(C)n1-c1ccc(Cl)c(Cl)c1)-c1nnc2CCCCCn12
: