Target
Stearoyl-CoA desaturase
Ligand
BDBM50445723
Substrate
Meas. Tech.
ChEMBL_1284540 (CHEMBL3106735)
IC50
2536±n/a nM
Citation
 Sun, SZhang, ZRaina, VPokrovskaia, NHou, DNamdari, RKhakh, KRatkay, LGMcLaren, DGMork, MFu, JFerreira, SHubbard, BWinther, MDDales, N Discovery of thiazolylpyridinone SCD1 inhibitors with preferential liver distribution and reduced mechanism-based adverse effects. Bioorg Med Chem Lett 24:526-31 (2014)  
Target
Name:
Stearoyl-CoA desaturase
Synonyms:
Acyl-CoA desaturase SCD SCDOS Stearoyl-CoA (SCD1) | Stearoyl-CoA desaturase 1
Type:
Enzyme
Mol. Mass.:
41537.27
Organism:
Homo sapiens (Human)
Description:
O00767
Residue:
359
  
Inhibitor
Name:
BDBM50445723
Synonyms:
CHEMBL3104398
Type:
Small organic molecule
Emp. Form.:
C17H15N3O2S
Mol. Mass.:
325.385
SMILES:
Cc1nc(sc1C(=O)NCc1ccccc1)-n1ccccc1=O
: