Target
Substance-P receptor
Ligand
BDBM50445807
Substrate
Meas. Tech.
ChEMBL_1284926 (CHEMBL3108367)
Ki
79±n/a nM
Citation
 Hanessian, SBabonneau, VBoyer, NMannoury la Cour, CMillan, MJDe Nanteuil, G Design and synthesis of potential dual NK(1)/NK(3) receptor antagonists. Bioorg Med Chem Lett 24:510-4 (2014)  
Target
Name:
Substance-P receptor
Synonyms:
NK-1 receptor NK1 Receptor NK1R_HUMAN Neurokinin-1 (NK-1) SPR TACR1 Tachykinin receptor 1 (NK1) | tachykinin
Type:
G Protein-Coupled Receptor (GPCR)
Mol. Mass.:
46254.43
Organism:
Homo sapiens (Human)
Description:
P25103
Residue:
407
  
Inhibitor
Name:
BDBM50445807
Synonyms:
CHEMBL3104778
Type:
Small organic molecule
Emp. Form.:
C27H31F6N3O3
Mol. Mass.:
559.5438
SMILES:
CN(CCN1CCOCC1)C(=O)[C@@H](NC(=O)C(C)(C)c1cc(cc(c1)C(F)(F)F)C(F)(F)F)c1ccccc1
: