Target
Lysine-specific histone demethylase 1A
Ligand
BDBM101302
Substrate
Meas. Tech.
ChEMBL_1288156 (CHEMBL3110659)
Ki
9.0±n/a nM
Citation
 Kumarasinghe, IRWoster, PM Synthesis and evaluation of novel cyclic Peptide inhibitors of lysine-specific demethylase 1. ACS Med Chem Lett 5:29-33 (2014)  
Target
Name:
Lysine-specific histone demethylase 1A
Synonyms:
AOF2 Flavin-containing amine oxidase domain-containing protein 2 KDM1A KIAA0601 Lysine-specific demethylase 1 (LSD1) Lysine-specific histone demethylase 1 (LSD1)
Type:
Enzyme
Mol. Mass.:
92901.01
Organism:
Homo sapiens (Human)
Description:
O60341
Residue:
852
  
Inhibitor
Name:
BDBM101302
Synonyms:
CHEMBL3108900 | US8524717, 57
Type:
Small organic molecule
Emp. Form.:
C23H25F4N3O
Mol. Mass.:
435.4577
SMILES:
CN1CCN(CC1)C(=O)CN[C@H]1C[C@@H]1c1ccc(cc1)-c1cc(F)ccc1C(F)(F)F
: