Target
Neuronal acetylcholine receptor subunit alpha-3/beta-4
Ligand
BDBM50446493
Substrate
Meas. Tech.
ChEMBL_1287913 (CHEMBL3112332)
Ki
61750±n/a nM
Citation
 Wu, JZhang, YMaida, LESantos, RGWelmaker, GSLaVoi, TMNefzi, AYu, YHoughten, RAToll, LGiulianotti, MA Scaffold ranking and positional scanning utilized in the discovery of nAChR-selective compounds suitable for optimization studies. J Med Chem 56:10103-17 (2013)  
Target
Name:
Neuronal acetylcholine receptor subunit alpha-3/beta-4
Synonyms:
Neuronal acetylcholine receptor Alpha-3/Beta-4 Neuronal acetylcholine receptor; alpha3/beta4 | nAChR subtypes alpha3 beta4
Type:
Protein
Mol. Mass.:
Description:
Components:
This complex has 2 components.
Component 1
Name:
Neuronal acetylcholine receptor subunit alpha-3
Synonyms:
ACHA3_RAT Chrna3
Type:
Enzyme
Mol. Mass.:
56995.52
Organism:
Rattus norvegicus (Rat)
Description:
P04757
Residue:
499
  
Component 2
Name:
Neuronal acetylcholine receptor subunit beta-4
Synonyms:
ACHB4_RAT Chrnb4 Neuronal acetylcholine receptor non-alpha-2 chain | Neuronal acetylcholine receptor protein beta-4 subunit
Type:
Enzyme
Mol. Mass.:
55863.89
Organism:
Rattus norvegicus (Rat)
Description:
P12392
Residue:
495
  
Inhibitor
Name:
BDBM50446493
Synonyms:
CHEMBL3110031
Type:
Small organic molecule
Emp. Form.:
C36H53FN6
Mol. Mass.:
588.8446
SMILES:
CC(C)(C)C1CCC(CN2[C@H](Cc3ccccc3)CN(CCCC[C@H]3CN=C(N)N3CCc3cccc(F)c3)C2=N)CC1
: