Target
Cytochrome P450 3A4
Ligand
BDBM50446514
Substrate
Meas. Tech.
ChEMBL_1286293 (CHEMBL3111264)
IC50
>25000±n/a nM
Citation
 Bourbeau, MPSiegmund, AAllen, JGShu, HFotsch, CBartberger, MDKim, KWKomorowski, RGraham, MBusby, JWang, MMeyer, JXu, YSalyers, KFielden, MVéniant, MMGu, W Piperazine oxadiazole inhibitors of acetyl-CoA carboxylase. J Med Chem 56:10132-41 (2013)  
Target
Name:
Cytochrome P450 3A4
Synonyms:
Albendazole monooxygenase CP3A4_HUMAN CYP3A4 CYPIIIA4 Cytochrome P450 3A4 (CYP3A4) Nifedipine oxidase Taurochenodeoxycholate 6-alpha-hydroxylase
Type:
Enzyme
Mol. Mass.:
57349.57
Organism:
Homo sapiens (Human)
Description:
Residue:
503
  
Inhibitor
Name:
BDBM50446514
Synonyms:
CHEMBL3110076
Type:
Small organic molecule
Emp. Form.:
C22H31N5O3
Mol. Mass.:
413.5132
SMILES:
CCOc1ccc(N2CCN([C@@H](C)C2)c2noc(n2)C2(CCC2)NC(C)=O)c(C)c1
: