Target
Prolyl hydroxylase EGLN3
Ligand
BDBM50446906
Substrate
Meas. Tech.
ChEMBL_1290488 (CHEMBL3119779)
IC50
1.000000±n/a nM
Citation
 Rabinowitz, MH Inhibition of hypoxia-inducible factor prolyl hydroxylase domain oxygen sensors: tricking the body into mounting orchestrated survival and repair responses. J Med Chem 56:9369-402 (2014)  
Target
Name:
Prolyl hydroxylase EGLN3
Synonyms:
EGLN3 Egl nine homolog 3 (EGLIN3) | Egl nine homolog 3 (EGLN3)
Type:
Protein
Mol. Mass.:
27265.54
Organism:
Homo sapiens (Human)
Description:
Q9H6Z9
Residue:
239
  
Inhibitor
Name:
BDBM50446906
Synonyms:
CHEMBL3115290
Type:
Small organic molecule
Emp. Form.:
C16H12N4O4
Mol. Mass.:
324.2909
SMILES:
OC(=O)CNC(=O)c1c(O)c(cc2nccnc12)-c1cccnc1
: