Target
D(2) dopamine receptor
Ligand
BDBM50446922
Substrate
Meas. Tech.
ChEMBL_1290725 (CHEMBL3117737)
Ki
131±n/a nM
Citation
 van Wieringen, JPShalgunov, VJanssen, HMFransen, PMJanssen, AGMichel, MCBooij, JElsinga, PH Synthesis and characterization of a novel series of agonist compounds as potential radiopharmaceuticals for imaging dopamine D2/3 receptors in their high-affinity state. J Med Chem 57:391-410 (2014)  
Target
Name:
D(2) dopamine receptor
Synonyms:
D(2) dopamine receptor DOPAMINE D2 Long DRD2 Dopamine D2 receptor Dopamine D2 receptor (D2R) Dopamine2-like | d2
Type:
Cell-surface receptors
Mol. Mass.:
50647.10
Organism:
Homo sapiens (Human)
Description:
P14416
Residue:
443
  
Inhibitor
Name:
BDBM50446922
Synonyms:
CHEMBL3115578
Type:
Small organic molecule
Emp. Form.:
C22H28IN3O2
Mol. Mass.:
493.3811
SMILES:
Oc1ccc2CC[C@H](CNCCN3CCN(CC3)c3ccc(I)cc3)Oc2c1
: