Target
D(2) dopamine receptor
Ligand
BDBM50020217
Substrate
Meas. Tech.
ChEMBL_1290727 (CHEMBL3117739)
Ki
0.450±n/a nM
Citation
 van Wieringen, JPShalgunov, VJanssen, HMFransen, PMJanssen, AGMichel, MCBooij, JElsinga, PH Synthesis and characterization of a novel series of agonist compounds as potential radiopharmaceuticals for imaging dopamine D2/3 receptors in their high-affinity state. J Med Chem 57:391-410 (2014)  
Target
Name:
D(2) dopamine receptor
Synonyms:
D(2) dopamine receptor DOPAMINE D2 Long DRD2 Dopamine D2 receptor Dopamine D2 receptor (D2R) Dopamine2-like | d2
Type:
Cell-surface receptors
Mol. Mass.:
50647.10
Organism:
Homo sapiens (Human)
Description:
P14416
Residue:
443
  
Inhibitor
Name:
BDBM50020217
Synonyms:
(4aR,10bR)-4-propyl-3,4,4a,5,6,10b-hexahydro-2H-naphtho[1,2-b][1,4]oxazin-9-ol 4-Propyl-3,4,4a,5,6,10b-hexahydro-2H-naphtho[1,2-b][1,4]oxazin-9-ol NAXAGOLIDE HYDROCHLORIDE PHNO,(+)
Type:
Small organic molecule
Emp. Form.:
C15H21NO2
Mol. Mass.:
247.3327
SMILES:
CCCN1CCO[C@H]2[C@H]1CCc1ccc(O)cc21
: