Target
CD209 antigen
Ligand
BDBM50448401
Substrate
Meas. Tech.
ChEMBL_1292691 (CHEMBL3123558)
IC50
325000±n/a nM
Citation
 Tomašic, THajšek, DŠvajger, ULuzar, JObermajer, NPetit-Haertlein, IFieschi, FAnderluh, M Monovalent mannose-based DC-SIGN antagonists: targeting the hydrophobic groove of the receptor. Eur J Med Chem 75:308-26 (2014)  
Target
Name:
CD209 antigen
Synonyms:
C-type lectin domain family 4 member L CD209_HUMAN CLEC4L DC-SIGN1 | Dendritic cell-specific ICAM-3-grabbing non-integrin 1
Type:
PROTEIN
Mol. Mass.:
45768.84
Organism:
Homo sapiens (Human)
Description:
ChEMBL_104194
Residue:
404
  
Inhibitor
Name:
BDBM50448401
Synonyms:
CHEMBL3121700
Type:
Small organic molecule
Emp. Form.:
C32H43N5O11
Mol. Mass.:
673.7107
SMILES:
OC[C@H]1O[C@H](O[C@H]2C[C@@H]([C@H](C[C@@H]2OCCN=[N+]=[N-])C(=O)NCc2ccc(CO)cc2)C(=O)NCc2ccc(CO)cc2)[C@@H](O)[C@@H](O)[C@@H]1O
: