Target
Acetylcholinesterase
Ligand
BDBM50024206
Substrate
Meas. Tech.
ChEMBL_1295494 (CHEMBL3131492)
IC50
11400±n/a nM
Citation
 Queiroz, MMQueiroz, EFZeraik, MLEbrahimi, SNMarcourt, LCuendet, MCastro-Gamboa, IHamburger, Mda Silva Bolzani, VWolfender, JL Chemical composition of the bark of Tetrapterys mucronata and identification of acetylcholinesterase inhibitory constituents. J Nat Prod 77:650-6 (2014)  
Target
Name:
Acetylcholinesterase
Synonyms:
ACES_ELEEL Acetylcholinesterase (EeAChE) | ache
Type:
Enzyme
Mol. Mass.:
71812.79
Organism:
Electrophorus electricus (Electric eel)
Description:
Residue:
633
  
Inhibitor
Name:
BDBM50024206
Synonyms:
3-[2-(dimethylamino)ethyl]-1H-indol-5-ol 3-[2-(dimethylamino)ethyl]indol-5-ol 5-hydroxy-N,N-dimethyltryptamine Bufotenine DM5-HT N,N-dimethylserotonin
Type:
Small organic molecule
Emp. Form.:
C12H16N2O
Mol. Mass.:
204.2682
SMILES:
CN(C)CCc1c[nH]c2ccc(O)cc12
: