Target
Glucokinase regulatory protein
Ligand
BDBM50448563
Substrate
Meas. Tech.
ChEMBL_1296098 (CHEMBL3131527)
EC50
5470±n/a nM
Citation
 Ashton, KSAndrews, KLBryan, MCBryan, MCChen, JChen, KChen, MChmait, SCroghan, MCupples, RFotsch, CHelmering, JJordan, SRKurzeja, RJMichelsen, KPennington, LDPoon, SFSivits, GVan, GVonderfecht, SLWahl, RCZhang, JLloyd, DJHale, CSt Jean, DJ Small molecule disruptors of the glucokinase-glucokinase regulatory protein interaction: 1. Discovery of a novel tool compound for in vivo proof-of-concept. J Med Chem 57:309-24 (2014)  
Target
Name:
Glucokinase regulatory protein
Synonyms:
GCKR_RAT Glucokinase regulator
Type:
PROTEIN
Mol. Mass.:
68920.17
Organism:
Rattus norvegicus
Description:
ChEMBL_108045
Residue:
627
  
Inhibitor
Name:
BDBM50448563
Synonyms:
CHEMBL3127347
Type:
Small organic molecule
Emp. Form.:
C23H26F6N2O4S2
Mol. Mass.:
572.584
SMILES:
OC(c1ccc(cc1)N1CCN(C[C@@H]1CC1CCOCC1)S(=O)(=O)c1cccs1)(C(F)(F)F)C(F)(F)F
: