Target
Neuropeptide Y receptor type 5
Ligand
BDBM50449331
Substrate
Meas. Tech.
ChEMBL_1296657 (CHEMBL3131566)
Ki
3.0±n/a nM
Citation
 Burns, JFChen, BChen, CADoller, DEdelmenky, EJiang, YPeterson, JMSabio, MWeiss, JWhite, ADWu, LBhardwaj, RChandrasena, GBoyle, NJHuang, X cis-1-Oxo-heterocyclyl-4-amido cyclohexane derivatives as NPY5 receptor antagonists. Bioorg Med Chem Lett 24:1458-61 (2014)  
Target
Name:
Neuropeptide Y receptor type 5
Synonyms:
NPY-Y5 NPY5-R NPY5R_HUMAN NPYY5 Neuropeptide Y receptor type 5 ( NPY Y5) | Y5 receptor
Type:
Enzyme
Mol. Mass.:
50746.64
Organism:
Homo sapiens (Human)
Description:
Q15761
Residue:
445
  
Inhibitor
Name:
BDBM50449331
Synonyms:
CHEMBL3126043
Type:
Small organic molecule
Emp. Form.:
C22H23F2N3O3
Mol. Mass.:
415.4331
SMILES:
C[C@@H]1CN([C@H]2CC[C@H](CC2)C(=O)Nc2ccc(cn2)-c2cc(F)cc(F)c2)C(=O)O1
: