Target
Presequence protease, mitochondrial
Ligand
BDBM50449405
Substrate
Meas. Tech.
ChEMBL_1294277 (CHEMBL3128954)
EC50
713±n/a nM
Citation
 Vangavaragu, JRValasani, KRGan, XYan, SS Identification of human presequence protease (hPreP) agonists for the treatment of Alzheimer's disease. Eur J Med Chem 76:506-16 (2014)  
Target
Name:
Presequence protease, mitochondrial
Synonyms:
KIAA1104 Metalloprotease 1 PREP Pitrilysin metalloproteinase 1 hPreP
Type:
PROTEIN
Mol. Mass.:
117419.85
Organism:
Homo sapiens (Human)
Description:
ChEMBL_108043
Residue:
1037
  
Inhibitor
Name:
BDBM50449405
Synonyms:
CHEMBL3127264
Type:
Small organic molecule
Emp. Form.:
C20H13Br2N3O4
Mol. Mass.:
519.143
SMILES:
Oc1ccc(Br)cc1Cn1c(nc2ccc(cc12)[N+]([O-])=O)-c1cc(Br)ccc1O
: