Target
Neuronal acetylcholine receptor subunit alpha-3/beta-2
Ligand
BDBM50452054
Substrate
Meas. Tech.
ChEMBL_143249 (CHEMBL752537)
Ki
6.2±n/a nM
Citation
 Wei, ZLXiao, YKellar, KJKozikowski, AP Synthesis and pharmacological characterization of bivalent ligands of epibatidine at neuronal nicotinic acetylcholine receptors. Bioorg Med Chem Lett 14:1855-8 (2004)  
Target
Name:
Neuronal acetylcholine receptor subunit alpha-3/beta-2
Synonyms:
Neuronal acetylcholine receptor Alpha-3/Beta-2 Neuronal acetylcholine receptor; alpha3/beta2 | nAChR subtypes alpha3 beta2
Type:
Protein
Mol. Mass.:
Description:
Components:
This complex has 2 components.
Component 1
Name:
Neuronal acetylcholine receptor subunit alpha-3
Synonyms:
ACHA3_RAT Chrna3
Type:
Enzyme
Mol. Mass.:
56995.52
Organism:
Rattus norvegicus (Rat)
Description:
P04757
Residue:
499
  
Component 2
Name:
Neuronal acetylcholine receptor subunit beta-2
Synonyms:
ACHB2_RAT Chrnb2 Neuronal acetylcholine receptor non-alpha-1 chain
Type:
Enzyme
Mol. Mass.:
56910.32
Organism:
Rattus norvegicus (Rat)
Description:
P12390
Residue:
500
  
Inhibitor
Name:
BDBM50452054
Synonyms:
CHEMBL53620
Type:
Small organic molecule
Emp. Form.:
C28H36Cl2N4
Mol. Mass.:
499.518
SMILES:
Clc1ccc(cn1)C1CC2CCC1N2CCCCCCN1C2CCC1C(C2)c1ccc(Cl)nc1
: