Target
Beta-2 adrenergic receptor
Ligand
BDBM50421721
Substrate
Meas. Tech.
ChEBML_37819
Kd
560±n/a nM
Citation
 IJzerman, APBultsma, TTimmerman, H Quantitative evaluation of the beta 2-adrenoceptor intrinsic activity of N-tert-butylphenylethanolamines. J Med Chem 29:549-54 (1986)  
Target
Name:
Beta-2 adrenergic receptor
Synonyms:
ADRB2 Beta-2 adrenergic receptor Beta-2 adrenoreceptor | adrenergic Beta
Type:
Enzyme Catalytic Domain
Mol. Mass.:
47141.18
Organism:
BOVINE
Description:
adrenergic Beta ADRB2 BOVINE::Q28044
Residue:
418
  
Inhibitor
Name:
BDBM50421721
Synonyms:
CHEMBL1159712 | SKF-56301
Type:
Small organic molecule
Emp. Form.:
C13H22N2O2
Mol. Mass.:
238.326
SMILES:
CNc1cc(ccc1O)C(O)CNC(C)(C)C
: