Target
Indolethylamine N-methyltransferase
Ligand
BDBM50000115
Substrate
Meas. Tech.
ChEMBL_1333667 (CHEMBL3231053)
IC50
200±n/a nM
Citation
 Rokach, JHamel, PHunter, NRReader, GRooney, CSAnderson, PSCragoe, EJMandel, LR Cyclic amidine inhibitors of indolamine N-methyltransferase. J Med Chem 22:237-47 (1979)  
Target
Name:
Indolethylamine N-methyltransferase
Synonyms:
Amine N-methyltransferase Arylamine N-methyltransferase INMT_RABIT Thioether S-methyltransferase
Type:
PROTEIN
Mol. Mass.:
28949.17
Organism:
Oryctolagus cuniculus
Description:
ChEMBL_108264
Residue:
263
  
Inhibitor
Name:
BDBM50000115
Synonyms:
CHEMBL3228354
Type:
Small organic molecule
Emp. Form.:
C9H14N2O4S
Mol. Mass.:
246.283
SMILES:
CCN1CCSC1=N.OC(=O)\C=C\C(O)=O
: