Target
Indolethylamine N-methyltransferase
Ligand
BDBM50000168
Substrate
Meas. Tech.
ChEMBL_1333667 (CHEMBL3231053)
IC50
74800±n/a nM
Citation
 Rokach, JHamel, PHunter, NRReader, GRooney, CSAnderson, PSCragoe, EJMandel, LR Cyclic amidine inhibitors of indolamine N-methyltransferase. J Med Chem 22:237-47 (1979)  
Target
Name:
Indolethylamine N-methyltransferase
Synonyms:
Amine N-methyltransferase Arylamine N-methyltransferase INMT_RABIT Thioether S-methyltransferase
Type:
PROTEIN
Mol. Mass.:
28949.17
Organism:
Oryctolagus cuniculus
Description:
ChEMBL_108264
Residue:
263
  
Inhibitor
Name:
BDBM50000168
Synonyms:
CHEMBL3228260
Type:
Small organic molecule
Emp. Form.:
C8H14N2
Mol. Mass.:
138.2102
SMILES:
C1CN2CCCCN=C2C1
: