Target
Aldo-keto reductase family 1 member B1
Ligand
BDBM50001062
Substrate
Meas. Tech.
ChEMBL_1337655 (CHEMBL3242843)
IC50
>100000±n/a nM
Citation
 Chatzopoulou, MPatsilinakos, AVallianatou, TPrnova, MSZakelj, SRagno, RStefek, MKristl, ATsantili-Kakoulidou, ADemopoulos, VJ Decreasing acidity in a series of aldose reductase inhibitors: 2-Fluoro-4-(1H-pyrrol-1-yl)phenol as a scaffold for improved membrane permeation. Bioorg Med Chem 22:2194-207 (2014)  
Target
Name:
Aldo-keto reductase family 1 member B1
Synonyms:
ALDR_RAT Akr1b4 Aldr1
Type:
PROTEIN
Mol. Mass.:
35797.87
Organism:
Rattus norvegicus
Description:
ChEMBL_1512484
Residue:
316
  
Inhibitor
Name:
BDBM50001062
Synonyms:
CHEMBL3236021
Type:
Small organic molecule
Emp. Form.:
C12H7F4NO2
Mol. Mass.:
273.1831
SMILES:
Oc1ccc(cc1F)-n1ccc(c1)C(=O)C(F)(F)F
: