Target
E3 ubiquitin-protein ligase XIAP
Ligand
BDBM50001129
Substrate
Meas. Tech.
ChEMBL_1338070 (CHEMBL3241791)
IC50
4.00±n/a nM
Citation
 Hird, AWAquila, BMBlock, MHHennessy, EJKamhi, VMOmer, CALaing, NMSaeh, JCSha, LYang, B Structure-based design and synthesis of tricyclic IAP (Inhibitors of Apoptosis Proteins) inhibitors. Bioorg Med Chem Lett 24:1820-4 (2014)  
Target
Name:
E3 ubiquitin-protein ligase XIAP
Synonyms:
API3 E3 ubiquitin-protein ligase XIAP Inhibitor of apoptosis protein 3 X-linked inhibitor of apoptosis XIAP | XIAP_HUMAN
Type:
Protein
Mol. Mass.:
56685.27
Organism:
Homo sapiens (Human)
Description:
P98170
Residue:
497
  
Inhibitor
Name:
BDBM50001129
Synonyms:
CHEMBL3236390
Type:
Small organic molecule
Emp. Form.:
C54H70N8O8
Mol. Mass.:
959.1824
SMILES:
[H][C@]12C[C@@]3([H])CCN(C[C@@]3([H])N1C(=O)[C@H](CCC2)NC(=O)[C@H](C)NC)C(=O)C(OCC#CC#CCOC(C(=O)N1CC[C@]2([H])C[C@]3([H])CCC[C@H](NC(=O)[C@H](C)NC)C(=O)N3[C@]2([H])C1)c1ccccc1)c1ccccc1
: