Target
Neuronal acetylcholine receptor subunit alpha-3/beta-4
Ligand
BDBM50006629
Substrate
Meas. Tech.
ChEMBL_1335310 (CHEMBL3238807)
Ki
30000±n/a nM
Citation
 Crestey, FJensen, AABorch, MAndreasen, JTAndersen, JBalle, TKristensen, JL Design, synthesis, and biological evaluation of Erythrina alkaloid analogues as neuronal nicotinic acetylcholine receptor antagonists. J Med Chem 56:9673-82 (2014)  
Target
Name:
Neuronal acetylcholine receptor subunit alpha-3/beta-4
Synonyms:
Neuronal acetylcholine receptor Alpha-3/Beta-4 Neuronal acetylcholine receptor; alpha3/beta4 | nAChR subtypes alpha3 beta4
Type:
Protein
Mol. Mass.:
Description:
Components:
This complex has 2 components.
Component 1
Name:
Neuronal acetylcholine receptor subunit alpha-3
Synonyms:
ACHA3_RAT Chrna3
Type:
Enzyme
Mol. Mass.:
56995.52
Organism:
Rattus norvegicus (Rat)
Description:
P04757
Residue:
499
  
Component 2
Name:
Neuronal acetylcholine receptor subunit beta-4
Synonyms:
ACHB4_RAT Chrnb4 Neuronal acetylcholine receptor non-alpha-2 chain | Neuronal acetylcholine receptor protein beta-4 subunit
Type:
Enzyme
Mol. Mass.:
55863.89
Organism:
Rattus norvegicus (Rat)
Description:
P12392
Residue:
495
  
Inhibitor
Name:
BDBM50006629
Synonyms:
CHEMBL3235505
Type:
Small organic molecule
Emp. Form.:
C17H21NO2
Mol. Mass.:
271.3541
SMILES:
[H][C@]12CCN3CCc4cc5OCOc5cc4[C@]13CCCC2
: