Target
Poly [ADP-ribose] polymerase 1
Ligand
BDBM50007192
Substrate
Meas. Tech.
ChEMBL_1337926 (CHEMBL3241059)
IC50
58±n/a nM
Citation
 Maciag, AEHolland, RJKim, YKumari, VLuthers, CESehareen, WSBiswas, DMorris, NLJi, XAnderson, LMSaavedra, JEKeefer, LK Nitric oxide (NO) releasing poly ADP-ribose polymerase 1 (PARP-1) inhibitors targeted to glutathione S-transferase P1-overexpressing cancer cells. J Med Chem 57:2292-302 (2014)  
Target
Name:
Poly [ADP-ribose] polymerase 1
Synonyms:
(ARTD1 or PARP1) 2.4.2.30 ADPRT ARTD1 Human diphtheria toxin-like ADP-ribosyltransferase (ARTD1 or PARP1) NT-PARP-1 PARP1 PPOL Poly [ADP-ribose] polymerase 1 (PARP) Poly [ADP-ribose] polymerase 1 (PARP1) Poly [ADP-ribose] polymerase 1, 28-kDa form Poly [ADP-ribose] polymerase 1, processed C-terminus Poly [ADP-ribose] polymerase-1 Poly(ADP-ribose) polymerase-1 (ARTD1/PARP1) Protein poly-ADP-ribosyltransferase PARP1 | Synonyms=ADPRT
Type:
Mol. Mass.:
113114.22
Organism:
Homo sapiens (Human)
Description:
P09874
Residue:
1014
  
Inhibitor
Name:
BDBM50007192
Synonyms:
CHEMBL3237591
Type:
Small organic molecule
Emp. Form.:
C26H21FN8O8
Mol. Mass.:
592.4921
SMILES:
[O-][N+](=O)c1ccc(O\N=[N+](/[O-])N2CCN(CC2)C(=O)c2cc(Cc3n[nH]c(=O)c4ccccc34)ccc2F)c(c1)[N+]([O-])=O
: