Target
Poly [ADP-ribose] polymerase 1
Ligand
BDBM27566
Substrate
Meas. Tech.
ChEMBL_1337925 (CHEMBL3241058)
IC50
16±n/a nM
Citation
 Maciag, AEHolland, RJKim, YKumari, VLuthers, CESehareen, WSBiswas, DMorris, NLJi, XAnderson, LMSaavedra, JEKeefer, LK Nitric oxide (NO) releasing poly ADP-ribose polymerase 1 (PARP-1) inhibitors targeted to glutathione S-transferase P1-overexpressing cancer cells. J Med Chem 57:2292-302 (2014)  
Target
Name:
Poly [ADP-ribose] polymerase 1
Synonyms:
(ARTD1 or PARP1) 2.4.2.30 ADPRT ARTD1 Human diphtheria toxin-like ADP-ribosyltransferase (ARTD1 or PARP1) NT-PARP-1 PARP1 PPOL Poly [ADP-ribose] polymerase 1 (PARP) Poly [ADP-ribose] polymerase 1 (PARP1) Poly [ADP-ribose] polymerase 1, 28-kDa form Poly [ADP-ribose] polymerase 1, processed C-terminus Poly [ADP-ribose] polymerase-1 Poly(ADP-ribose) polymerase-1 (ARTD1/PARP1) Protein poly-ADP-ribosyltransferase PARP1 | Synonyms=ADPRT
Type:
Mol. Mass.:
113114.22
Organism:
Homo sapiens (Human)
Description:
P09874
Residue:
1014
  
Inhibitor
Name:
BDBM27566
Synonyms:
4-({3-[(4-cyclopropanecarbonylpiperazin-1-yl)carbonyl]-4-fluorophenyl}methyl)-1,2-dihydrophthalazin-1-one Olaparib US10597399, Compound AZD2281 US9255106, AZD2281
Type:
Small organic molecule
Emp. Form.:
C24H23FN4O3
Mol. Mass.:
434.4628
SMILES:
Fc1ccc(Cc2n[nH]c(=O)c3ccccc23)cc1C(=O)N1CCN(CC1)C(=O)C1CC1
: