Target
Adenosine receptor A3
Ligand
BDBM50007296
Substrate
Meas. Tech.
ChEMBL_1338754 (CHEMBL3242377)
Ki
2429±n/a nM
Citation
 DeMong, DDai, XHwa, JMiller, MLin, SIKang, LStamford, AGreenlee, WYu, WWong, MLavey, BKozlowski, JZhou, GYang, DYPatel, BSoriano, AZhai, YSondey, CZhang, HLachowicz, JGrotz, DCox, KMorrison, RAndreani, TCao, YLiang, MMeng, TMcNamara, PWong, JBradley, PFeng, KIBelani, JChen, PDai, PGauuan, JLin, PZhao, H The discovery of N-((2H-tetrazol-5-yl)methyl)-4-((R)-1-((5r,8R)-8-(tert-butyl)-3-(3,5-dichlorophenyl)-2-oxo-1,4-diazaspiro[4.5]dec-3-en-1-yl)-4,4-dimethylpentyl)benzamide (SCH 900822): a potent and selective glucagon receptor antagonist. J Med Chem 57:2601-10 (2014)  
Target
Name:
Adenosine receptor A3
Synonyms:
A3 adenosine receptor (hA3) ADORA3 | Adenosine A3 receptor (A3AR)
Type:
G Protein-Coupled Receptor (GPCR)
Mol. Mass.:
36197.32
Organism:
Homo sapiens (Human)
Description:
P0DMS8
Residue:
318
  
Inhibitor
Name:
BDBM50007296
Synonyms:
CHEMBL3238246
Type:
Small organic molecule
Emp. Form.:
C34H43Cl2N7O2
Mol. Mass.:
652.657
SMILES:
CC(C)(C)CC[C@@H](N1C(=O)C(=N[C@@]11CC[C@@H](CC1)C(C)(C)C)c1cc(Cl)cc(Cl)c1)c1ccc(cc1)C(=O)NCc1nn[nH]n1
: