Target
Cruzipain
Ligand
BDBM50322742
Substrate
Meas. Tech.
ChEMBL_1339563 (CHEMBL3243043)
IC50
800±n/a nM
Citation
 Ferreira, RSDessoy, MAPauli, ISouza, MLKrogh, RSales, AIOliva, GDias, LCAndricopulo, AD Synthesis, biological evaluation, and structure-activity relationships of potent noncovalent and nonpeptidic cruzain inhibitors as anti-Trypanosoma cruzi agents. J Med Chem 57:2380-92 (2014)  
Target
Name:
Cruzipain
Synonyms:
CYSP_TRYCR Cruzaine | Major cysteine proteinase
Type:
Protein
Mol. Mass.:
49831.41
Organism:
Trypanosoma cruzi
Description:
P25779
Residue:
467
  
Inhibitor
Name:
BDBM50322742
Synonyms:
CHEMBL1173694 N-[2-(1H-benzimidazol-2-yl)ethyl]-2-(2-bromophenoxy)acetamide
Type:
Small organic molecule
Emp. Form.:
C17H16BrN3O2
Mol. Mass.:
374.232
SMILES:
Brc1ccccc1OCC(=O)NCCc1nc2ccccc2[nH]1
: