Target
E3 ubiquitin-protein ligase Mdm2
Ligand
BDBM50007650
Substrate
Meas. Tech.
ChEMBL_1339579 (CHEMBL3243059)
IC50
20±n/a nM
Citation
 Gonzalez, AZEksterowicz, JBartberger, MDBeck, HPCanon, JChen, AChow, DDuquette, JFox, BMFu, JHuang, XHouze, JBJin, LLi, YLi, ZLing, YLo, MCLong, AMMcGee, LRMcIntosh, JMcMinn, DLOliner, JDOsgood, TRew, YSaiki, AYShaffer, PWortman, SYakowec, PYan, XYe, QYu, DZhao, XZhou, JOlson, SHMedina, JCSun, D Selective and potent morpholinone inhibitors of the MDM2-p53 protein-protein interaction. J Med Chem 57:2472-88 (2014)  
Target
Name:
E3 ubiquitin-protein ligase Mdm2
Synonyms:
Double minute 2 protein E3 ubiquitin-protein ligase Mdm2 (p53-binding protein Mdm2) Human Double Minute 2 (HDM2) MDM2-MDMX p53-Binding Protein MDM2 | p53-binding protein
Type:
Oncoprotein
Mol. Mass.:
55196.54
Organism:
Homo sapiens (Human)
Description:
Q00987
Residue:
491
  
Inhibitor
Name:
BDBM50007650
Synonyms:
CHEMBL3233132
Type:
Small organic molecule
Emp. Form.:
C27H31Cl2NO6S
Mol. Mass.:
568.509
SMILES:
CC[C@@H](CS(=O)(=O)C1CCCC1)N1[C@@H]([C@H](O[C@H](CC(O)=O)C1=O)c1cccc(Cl)c1)c1ccc(Cl)cc1
: