Target
Plasminogen
Ligand
BDBM50009172
Substrate
Meas. Tech.
ChEMBL_1338844 (CHEMBL3242934)
IC50
180000±n/a nM
Citation
 Teno, NGohda, KWanaka, KTsuda, YSueda, TYamashita, YOtsubo, T Pyrrolopyrimidine-inhibitors with hydantoin moiety as spacer can explore P4/S4 interaction on plasmin. Bioorg Med Chem 22:2339-52 (2014)  
Target
Name:
Plasminogen
Synonyms:
Activation peptide PLG Plasmin Plasmin heavy chain A, short form | Plasmin light chain B
Type:
Enzyme
Mol. Mass.:
90579.18
Organism:
Homo sapiens (Human)
Description:
Residue:
810
  
Inhibitor
Name:
BDBM50009172
Synonyms:
CHEMBL3238363
Type:
Small organic molecule
Emp. Form.:
C25H28N8O4
Mol. Mass.:
504.541
SMILES:
COc1ccc(cc1)N1CC(=O)N(Cc2cc3cnc(nc3n2C)C(=O)N[C@@H](CCCCN)C#N)C1=O
: