Target
Plasminogen
Ligand
BDBM50009197
Substrate
Meas. Tech.
ChEMBL_1338844 (CHEMBL3242934)
IC50
400000±n/a nM
Citation
 Teno, NGohda, KWanaka, KTsuda, YSueda, TYamashita, YOtsubo, T Pyrrolopyrimidine-inhibitors with hydantoin moiety as spacer can explore P4/S4 interaction on plasmin. Bioorg Med Chem 22:2339-52 (2014)  
Target
Name:
Plasminogen
Synonyms:
Activation peptide PLG Plasmin Plasmin heavy chain A, short form | Plasmin light chain B
Type:
Enzyme
Mol. Mass.:
90579.18
Organism:
Homo sapiens (Human)
Description:
Residue:
810
  
Inhibitor
Name:
BDBM50009197
Synonyms:
CHEMBL3238372
Type:
Small organic molecule
Emp. Form.:
C26H29N9O5
Mol. Mass.:
547.5658
SMILES:
Cn1c(CN2C(=O)CN(C2=O)c2ccc(OCC(N)=O)cc2)cc2cnc(nc12)C(=O)N[C@@H](CCCCN)C#N
: