Target
Plasminogen
Ligand
BDBM50009206
Substrate
Meas. Tech.
ChEMBL_1338844 (CHEMBL3242934)
IC50
170000±n/a nM
Citation
 Teno, NGohda, KWanaka, KTsuda, YSueda, TYamashita, YOtsubo, T Pyrrolopyrimidine-inhibitors with hydantoin moiety as spacer can explore P4/S4 interaction on plasmin. Bioorg Med Chem 22:2339-52 (2014)  
Target
Name:
Plasminogen
Synonyms:
Activation peptide PLG Plasmin Plasmin heavy chain A, short form | Plasmin light chain B
Type:
Enzyme
Mol. Mass.:
90579.18
Organism:
Homo sapiens (Human)
Description:
Residue:
810
  
Inhibitor
Name:
BDBM50009206
Synonyms:
CHEMBL3233150
Type:
Small organic molecule
Emp. Form.:
C31H32N10O5
Mol. Mass.:
624.6498
SMILES:
Cn1c(CN2C(=O)CN(C2=O)c2ccc(OCc3ccncc3)c(c2)C(N)=O)cc2cnc(nc12)C(=O)N[C@@H](CCCCN)C#N
: