Target
Plasma kallikrein
Ligand
BDBM50009173
Substrate
Meas. Tech.
ChEMBL_1338845 (CHEMBL3242935)
IC50
>1000000±n/a nM
Citation
 Teno, NGohda, KWanaka, KTsuda, YSueda, TYamashita, YOtsubo, T Pyrrolopyrimidine-inhibitors with hydantoin moiety as spacer can explore P4/S4 interaction on plasmin. Bioorg Med Chem 22:2339-52 (2014)  
Target
Name:
Plasma kallikrein
Synonyms:
Fletcher factor KLKB1 Kallikrein Plasma kallikrein heavy chain Plasma prekallikrein
Type:
Protein
Mol. Mass.:
71391.16
Organism:
Homo sapiens (Human)
Description:
P03952
Residue:
638
  
Inhibitor
Name:
BDBM50009173
Synonyms:
CHEMBL3238364
Type:
Small organic molecule
Emp. Form.:
C27H32N8O3
Mol. Mass.:
516.5948
SMILES:
CCCc1ccc(cc1)N1CC(=O)N(Cc2cc3cnc(nc3n2C)C(=O)N[C@@H](CCCCN)C#N)C1=O
: