Target
Plasma kallikrein
Ligand
BDBM50009179
Substrate
Meas. Tech.
ChEMBL_1338845 (CHEMBL3242935)
IC50
>1000000±n/a nM
Citation
 Teno, NGohda, KWanaka, KTsuda, YSueda, TYamashita, YOtsubo, T Pyrrolopyrimidine-inhibitors with hydantoin moiety as spacer can explore P4/S4 interaction on plasmin. Bioorg Med Chem 22:2339-52 (2014)  
Target
Name:
Plasma kallikrein
Synonyms:
Fletcher factor KLKB1 Kallikrein Plasma kallikrein heavy chain Plasma prekallikrein
Type:
Protein
Mol. Mass.:
71391.16
Organism:
Homo sapiens (Human)
Description:
P03952
Residue:
638
  
Inhibitor
Name:
BDBM50009179
Synonyms:
CHEMBL3238370
Type:
Small organic molecule
Emp. Form.:
C25H25N9O3
Mol. Mass.:
499.5245
SMILES:
Cn1c(CN2C(=O)CN(C2=O)c2cccc(c2)C#N)cc2cnc(nc12)C(=O)N[C@@H](CCCCN)C#N
: