Target
Plasma kallikrein
Ligand
BDBM50009201
Substrate
Meas. Tech.
ChEMBL_1338845 (CHEMBL3242935)
IC50
>1000000±n/a nM
Citation
 Teno, NGohda, KWanaka, KTsuda, YSueda, TYamashita, YOtsubo, T Pyrrolopyrimidine-inhibitors with hydantoin moiety as spacer can explore P4/S4 interaction on plasmin. Bioorg Med Chem 22:2339-52 (2014)  
Target
Name:
Plasma kallikrein
Synonyms:
Fletcher factor KLKB1 Kallikrein Plasma kallikrein heavy chain Plasma prekallikrein
Type:
Protein
Mol. Mass.:
71391.16
Organism:
Homo sapiens (Human)
Description:
P03952
Residue:
638
  
Inhibitor
Name:
BDBM50009201
Synonyms:
CHEMBL3238375
Type:
Small organic molecule
Emp. Form.:
C31H32N8O5
Mol. Mass.:
596.6364
SMILES:
COc1ccc(Oc2ccc(cc2)N2CC(=O)N(Cc3cc4cnc(nc4n3C)C(=O)N[C@@H](CCCCN)C#N)C2=O)cc1
: