Target
Plasma kallikrein
Ligand
BDBM50009209
Substrate
Meas. Tech.
ChEMBL_1338845 (CHEMBL3242935)
IC50
>1000000±n/a nM
Citation
 Teno, NGohda, KWanaka, KTsuda, YSueda, TYamashita, YOtsubo, T Pyrrolopyrimidine-inhibitors with hydantoin moiety as spacer can explore P4/S4 interaction on plasmin. Bioorg Med Chem 22:2339-52 (2014)  
Target
Name:
Plasma kallikrein
Synonyms:
Fletcher factor KLKB1 Kallikrein Plasma kallikrein heavy chain Plasma prekallikrein
Type:
Protein
Mol. Mass.:
71391.16
Organism:
Homo sapiens (Human)
Description:
P03952
Residue:
638
  
Inhibitor
Name:
BDBM50009209
Synonyms:
CHEMBL3233152
Type:
Small organic molecule
Emp. Form.:
C30H32N8O3
Mol. Mass.:
552.6269
SMILES:
Cn1c(CN2CN(CC2=O)c2ccc(Oc3ccccc3)cc2)cc2cnc(nc12)C(=O)N[C@@H](CCCCN)C#N
: