Target
Urokinase-type plasminogen activator
Ligand
BDBM50009174
Substrate
Meas. Tech.
ChEMBL_1338846 (CHEMBL3242936)
IC50
>400000±n/a nM
Citation
 Teno, NGohda, KWanaka, KTsuda, YSueda, TYamashita, YOtsubo, T Pyrrolopyrimidine-inhibitors with hydantoin moiety as spacer can explore P4/S4 interaction on plasmin. Bioorg Med Chem 22:2339-52 (2014)  
Target
Name:
Urokinase-type plasminogen activator
Synonyms:
3.4.21.73 U-plasminogen activator Urokinase Urokinase-type plasminogen activator chain B Urokinase-type plasminogen activator short chain A uPA
Type:
Enzyme
Mol. Mass.:
48528.62
Organism:
Homo sapiens (Human)
Description:
P00749
Residue:
431
  
Inhibitor
Name:
BDBM50009174
Synonyms:
CHEMBL3238365
Type:
Small organic molecule
Emp. Form.:
C24H27N9O5S
Mol. Mass.:
553.593
SMILES:
Cn1c(CN2C(=O)CN(C2=O)c2ccc(cc2)S(N)(=O)=O)cc2cnc(nc12)C(=O)N[C@@H](CCCCN)C#N
: