Target
Prolyl endopeptidase
Ligand
BDBM50009341
Substrate
Meas. Tech.
ChEMBL_1335497 (CHEMBL3239282)
IC50
29100±n/a nM
Citation
 Jansen, KHeirbaut, LVerkerk, RCheng, JDJoossens, JCos, PMaes, LLambeir, AMDe Meester, IAugustyns, KVan der Veken, P Extended structure-activity relationship and pharmacokinetic investigation of (4-quinolinoyl)glycyl-2-cyanopyrrolidine inhibitors of fibroblast activation protein (FAP). J Med Chem 57:3053-74 (2014)  
Target
Name:
Prolyl endopeptidase
Synonyms:
PE POP PREP Prolyl oligopeptidase
Type:
Enzyme
Mol. Mass.:
80688.50
Organism:
Homo sapiens (Human)
Description:
P48147
Residue:
710
  
Inhibitor
Name:
BDBM50009341
Synonyms:
CHEMBL3233560 | US9346814, Cmpd No 16 Example 20
Type:
Small organic molecule
Emp. Form.:
C20H17N5O2
Mol. Mass.:
359.3813
SMILES:
O=C(CNC(=O)c1ccnc(c1)-c1ccc(cc1)C#N)N1CCC[C@H]1C#N
: