Target
Dipeptidyl peptidase 4
Ligand
BDBM50009341
Substrate
Meas. Tech.
ChEMBL_1335496 (CHEMBL3239281)
IC50
>100000±n/a nM
Citation
 Jansen, KHeirbaut, LVerkerk, RCheng, JDJoossens, JCos, PMaes, LLambeir, AMDe Meester, IAugustyns, KVan der Veken, P Extended structure-activity relationship and pharmacokinetic investigation of (4-quinolinoyl)glycyl-2-cyanopyrrolidine inhibitors of fibroblast activation protein (FAP). J Med Chem 57:3053-74 (2014)  
Target
Name:
Dipeptidyl peptidase 4
Synonyms:
ADABP Adenosine deaminase complexing protein 2 CD_antigen=CD26 DPP4 DPPIV Dipeptidyl peptidase 4 (DPP IV) Dipeptidyl peptidase 4 (DPP4) Dipeptidyl peptidase 4 membrane form Dipeptidyl peptidase IV Dipeptidyl peptidase IV (DDP-IV) Dipeptidyl peptidase IV membrane form Dipeptidyl peptidase-IV (DPP-4) T-cell activation antigen CD26 | TP103
Type:
Enzyme
Mol. Mass.:
88271.01
Organism:
Homo sapiens (Human)
Description:
P27487
Residue:
766
  
Inhibitor
Name:
BDBM50009341
Synonyms:
CHEMBL3233560 | US9346814, Cmpd No 16 Example 20
Type:
Small organic molecule
Emp. Form.:
C20H17N5O2
Mol. Mass.:
359.3813
SMILES:
O=C(CNC(=O)c1ccnc(c1)-c1ccc(cc1)C#N)N1CCC[C@H]1C#N
: