Target
Adenosine deaminase
Ligand
BDBM50010137
Substrate
Meas. Tech.
ChEMBL_1345454 (CHEMBL3257999)
Ki
11000±n/a nM
Citation
 Baker, DCHaskell, THPutt, SR Prodrugs of 9-beta-D-arabinofuranosyladenine. 1. Synthesis and evaluation of some 5'-(O-acyl) derivatives. J Med Chem 21:1218-21 (1979)  
Target
Name:
Adenosine deaminase
Synonyms:
ADA Adenosine aminohydrolase
Type:
Enzyme
Mol. Mass.:
40910.44
Organism:
Bos taurus (bovine)
Description:
Residue:
363
  
Inhibitor
Name:
BDBM50010137
Synonyms:
CHEMBL3246452
Type:
Small organic molecule
Emp. Form.:
C15H21N5O5
Mol. Mass.:
351.3577
SMILES:
CCCCC(=O)OC[C@H]1O[C@H]([C@@H](O)[C@@H]1O)n1cnc2c(N)ncnc12
: