Target
Dihydrofolate reductase
Ligand
BDBM50010233
Substrate
Meas. Tech.
ChEMBL_1341015 (CHEMBL3254994)
IC50
50±n/a nM
Citation
 Martinelli, JEChaykovsky, MKisliuk, RLGaumont, YGittelman, MC Methotrexate analogues. 12. Synthesis and biological properties of some aza homologues. J Med Chem 22:869-74 (1979)  
Target
Name:
Dihydrofolate reductase
Synonyms:
DYR_LACCA folA
Type:
PROTEIN
Mol. Mass.:
18437.08
Organism:
Lactobacillus casei
Description:
ChEMBL_1357878
Residue:
163
  
Inhibitor
Name:
BDBM50010233
Synonyms:
CHEMBL3245588
Type:
Small organic molecule
Emp. Form.:
C19H21N9O5
Mol. Mass.:
455.4273
SMILES:
CN(Cc1cnc2nc(N)nc(N)c2n1)c1ccc(NC(=O)NC(CC(O)=O)C(O)=O)cc1
: