Target
Aldo-keto reductase family 1 member B1 [K65Q]
Ligand
BDBM50010334
Substrate
Meas. Tech.
ChEMBL_1345576 (CHEMBL3252498)
Ki
5100±n/a nM
Citation
 Towell, JFErwin, VGDeitrich, RA Nicotinamide adenine dinucleotide phosphate-decanaldehyde adduct as an inhibitor of beef brain NADP-linked aldehyde reductase. J Med Chem 22:1011-4 (1979)  
Target
Name:
Aldo-keto reductase family 1 member B1 [K65Q]
Synonyms:
AKR1B1 Aldose reductase
Type:
Protein
Mol. Mass.:
35916.27
Organism:
Bos taurus (Cattle)
Description:
P16116[K65Q]
Residue:
315
  
Inhibitor
Name:
BDBM50010334
Synonyms:
CHEMBL3251378
Type:
Small organic molecule
Emp. Form.:
C29H36N7O18P3
Mol. Mass.:
863.5535
SMILES:
[H][C@@]12C=CN(C=C1C(=O)NC(O)C2c1ccccc1)[C@@H]1O[C@H](COP(O)(=O)O[C@@H]2[C@@H](COP(O)(=O)OP(O)(O)=O)O[C@H]([C@@H]2O)n2cnc3c(N)ncnc23)[C@@H](O)[C@H]1O
: