Target
DNA (cytosine-5)-methyltransferase 1
Ligand
BDBM50010380
Substrate
Meas. Tech.
ChEMBL_1353174 (CHEMBL3266276)
IC50
179000±n/a nM
Citation
 Devkota, KLohse, BLiu, QWang, MWStærk, DBerthelsen, JClausen, RP Analogues of the Natural Product Sinefungin as Inhibitors of EHMT1 and EHMT2. ACS Med Chem Lett 5:293-7 (2014)  
Target
Name:
DNA (cytosine-5)-methyltransferase 1
Synonyms:
AIM CXXC9 DNA (cytosine-5)-methyltransferase 1 isoform b DNA methyltransferase HsaI DNMT1 M.HsaI | MCMT
Type:
Enzyme
Mol. Mass.:
183184.85
Organism:
Homo sapiens (Human)
Description:
P26358
Residue:
1616
  
Inhibitor
Name:
BDBM50010380
Synonyms:
CHEMBL3263626
Type:
Small organic molecule
Emp. Form.:
C18H28N6O3
Mol. Mass.:
376.4533
SMILES:
NC(C[C@H]1O[C@H]([C@H](O)[C@@H]1O)n1cnc2c(N)ncnc12)CC1CCCCC1
: