Target
Mu-type opioid receptor
Ligand
BDBM50011516
Substrate
Meas. Tech.
ChEMBL_1351169 (CHEMBL3270912)
Ki
1.1±n/a nM
Citation
 Journigan, VBPolgar, WEKhroyan, TVZaveri, NT Designing bifunctional NOP receptor-mu opioid receptor ligands from NOP-receptor selective scaffolds. Part II. Bioorg Med Chem 22:2508-16 (2014)  
Target
Name:
Mu-type opioid receptor
Synonyms:
M-OR-1 MOR-1 MUOR1 Mu opiate receptor OPRM1 hMOP | mu-type opioid receptor isoform MOR-1
Type:
G Protein-Coupled Receptor (GPCR)
Mol. Mass.:
44789.51
Organism:
Homo sapiens (Human)
Description:
P35372
Residue:
400
  
Inhibitor
Name:
BDBM50011516
Synonyms:
CHEMBL3262546
Type:
Small organic molecule
Emp. Form.:
C25H30N2O
Mol. Mass.:
374.5185
SMILES:
CCC1C(=O)N(C2CCN(CC2)C2CCCc3ccccc23)c2ccccc12
: