Target
Follicle-stimulating hormone receptor
Ligand
BDBM50012113
Substrate
Meas. Tech.
ChEMBL_1351769 (CHEMBL3270558)
EC50
1850000±n/a nM
Citation
 Yu, HNRichardson, TENataraja, SFischer, DJSriraman, VJiang, XBharathi, PFoglesong, RJHaxell, TFHeasley, BHJenks, MLi, JDugas, MSCollis, RTian, HPalmer, SGoutopoulos, A Discovery of substituted benzamides as follicle stimulating hormone receptor allosteric modulators. Bioorg Med Chem Lett 24:2168-72 (2014)  
Target
Name:
Follicle-stimulating hormone receptor
Synonyms:
FSH-R FSHR_HUMAN Follicle-stimulating hormone receptor LGR1
Type:
PROTEIN
Mol. Mass.:
78273.21
Organism:
Homo sapiens (Human)
Description:
ChEMBL_1351769
Residue:
695
  
Inhibitor
Name:
BDBM50012113
Synonyms:
CHEMBL3263684
Type:
Small organic molecule
Emp. Form.:
C25H29N5O3
Mol. Mass.:
447.5295
SMILES:
Cc1ccccc1N1CCN(CC1)c1ccc(cc1NC(=O)c1ccco1)C(=O)NCCN
: