Target
Bromodomain-containing protein 4
Ligand
BDBM50015248
Substrate
Meas. Tech.
ChEMBL_1349750 (CHEMBL3267582)
IC50
7000±n/a nM
Citation
 Zhao, HGartenmann, LDong, JSpiliotopoulos, DCaflisch, A Discovery of BRD4 bromodomain inhibitors by fragment-based high-throughput docking. Bioorg Med Chem Lett 24:2493-6 (2014)  
Target
Name:
Bromodomain-containing protein 4
Synonyms:
BRD4 Bromodomain-containing protein 4 (BRD4) Protein HUNK1
Type:
Protein
Mol. Mass.:
152264.84
Organism:
Homo sapiens (Human)
Description:
O60885
Residue:
1362
  
Inhibitor
Name:
BDBM50015248
Synonyms:
CHEMBL3262777
Type:
Small organic molecule
Emp. Form.:
C17H19NO
Mol. Mass.:
253.3389
SMILES:
CCc1cc2c(CCCC2=O)n1Cc1ccccc1
: