Target
Tyrosine-protein kinase ITK/TSK
Ligand
BDBM50015252
Substrate
Meas. Tech.
ChEMBL_1349759 (CHEMBL3267591)
Ki
1.7±n/a nM
Citation
 Pastor, RMBurch, JDMagnuson, SOrtwine, DFChen, YDe La Torre, KDing, XEigenbrot, CJohnson, ALiimatta, MLiu, YShia, SWang, XWu, LCPei, Z Discovery and optimization of indazoles as potent and selective interleukin-2 inducible T cell kinase (ITK) inhibitors. Bioorg Med Chem Lett 24:2448-52 (2014)  
Target
Name:
Tyrosine-protein kinase ITK/TSK
Synonyms:
EMT ITK_HUMAN LYK Tyrosine-protein kinase ITK Tyrosine-protein kinase Lyk
Type:
Protein
Mol. Mass.:
71839.20
Organism:
Homo sapiens (Human)
Description:
Q08881
Residue:
620
  
Inhibitor
Name:
BDBM50015252
Synonyms:
CHEMBL3263039
Type:
Small organic molecule
Emp. Form.:
C18H14N4OS
Mol. Mass.:
334.395
SMILES:
O=C(Nc1cnc(Cc2ccccc2)s1)c1n[nH]c2ccccc12
: